Reaction Details
TargetCyclin-dependent kinase 1
LigandBDBM50113733
Substrate/Competitorn/a
Meas. Tech.ChEMBL_50316 (CHEMBL661621)
IC50 5000000±n/a nM
Citation Naumann, TMatter, H Structural classification of protein kinases using 3D molecular interaction field analysis of their ligand binding sites: target family landscapes. J Med Chem45:2366-78 (2002) Cyclin-dependent kinase 1
Name:Cyclin-dependent kinase 1
Type:Enzyme Subunit
Mol. Mass.:34101.08
Organism:Homo sapiens (Human)
Description:P06493
Residue:297
BDBM50113733
NameBDBM50113733
Synonyms:2-[[6-(3-Chloro-phenylamino)-9-isopropyl-9H-purin-2-yl]-(3-fluoro-benzyl)-amino]-3-methyl-butan-1-ol | CHEMBL445311
TypeSmall organic molecule
Emp. Form.C26H30ClFN6O
Mol. Mass.497.007
SMILESCC(C)[C@H](CO)N(Cc1cccc(F)c1)c1nc(Nc2cccc(Cl)c2)c2ncn(C(C)C)c2n1