Reaction Details
TargetCyclin-dependent kinase 1
LigandBDBM50113740
Substrate/Competitorn/a
Meas. Tech.ChEMBL_50316 (CHEMBL661621)
IC50 2800000±n/a nM
Citation Naumann, TMatter, H Structural classification of protein kinases using 3D molecular interaction field analysis of their ligand binding sites: target family landscapes. J Med Chem45:2366-78 (2002) Cyclin-dependent kinase 1
Name:Cyclin-dependent kinase 1
Type:Enzyme Subunit
Mol. Mass.:34101.08
Organism:Homo sapiens (Human)
Description:P06493
Residue:297
BDBM50113740
NameBDBM50113740
Synonyms:2-{Benzyl-[9-isopropyl-6-(4-methoxy-benzylamino)-9H-purin-2-yl]-amino}-ethanol | CHEMBL420571
TypeSmall organic molecule
Emp. Form.C25H30N6O2
Mol. Mass.446.5447
SMILESCOc1ccc(CNc2nc(nc3n(cnc23)C(C)C)N(CCO)Cc2ccccc2)cc1