Reaction Details
TargetCyclin-dependent kinase 1
LigandBDBM50113743
Substrate/Competitorn/a
Meas. Tech.ChEMBL_50316 (CHEMBL661621)
IC50 270000±n/a nM
Citation Naumann, TMatter, H Structural classification of protein kinases using 3D molecular interaction field analysis of their ligand binding sites: target family landscapes. J Med Chem45:2366-78 (2002) Cyclin-dependent kinase 1
Name:Cyclin-dependent kinase 1
Type:Enzyme Subunit
Mol. Mass.:34101.08
Organism:Homo sapiens (Human)
Description:P06493
Residue:297
BDBM50113743
NameBDBM50113743
Synonyms:2-[6-(3-Bromo-phenylamino)-9-isopropyl-9H-purin-2-ylamino]-ethanol | CHEMBL80916
TypeSmall organic molecule
Emp. Form.C16H19BrN6O
Mol. Mass.391.266
SMILESCC(C)n1cnc2c(Nc3cccc(Br)c3)nc(NCCO)nc12