Reaction Details
TargetCyclin-dependent kinase 1
LigandBDBM50113751
Substrate/Competitorn/a
Meas. Tech.ChEMBL_50316 (CHEMBL661621)
IC50 250000±n/a nM
Citation Naumann, TMatter, H Structural classification of protein kinases using 3D molecular interaction field analysis of their ligand binding sites: target family landscapes. J Med Chem45:2366-78 (2002) Cyclin-dependent kinase 1
Name:Cyclin-dependent kinase 1
Type:Enzyme Subunit
Mol. Mass.:34101.08
Organism:Homo sapiens (Human)
Description:P06493
Residue:297
BDBM50113751
NameBDBM50113751
Synonyms:3-{(2-Hydroxy-ethyl)-[9-isopropyl-6-(4-methoxy-benzylamino)-9H-purin-2-yl]-amino}-propan-1-ol | CHEMBL80225
TypeSmall organic molecule
Emp. Form.C21H30N6O3
Mol. Mass.414.5013
SMILESCOc1ccc(CNc2nc(nc3n(cnc23)C(C)C)N(CCO)CCCO)cc1