Reaction Details
TargetCyclin-dependent kinase 1
LigandBDBM50113753
Substrate/Competitorn/a
Meas. Tech.ChEMBL_50316 (CHEMBL661621)
IC50 7000000±n/a nM
Citation Naumann, TMatter, H Structural classification of protein kinases using 3D molecular interaction field analysis of their ligand binding sites: target family landscapes. J Med Chem45:2366-78 (2002) Cyclin-dependent kinase 1
Name:Cyclin-dependent kinase 1
Type:Enzyme Subunit
Mol. Mass.:34101.08
Organism:Homo sapiens (Human)
Description:P06493
Residue:297
BDBM50113753
NameBDBM50113753
Synonyms:2-{4-[9-Isopropyl-6-(4-methoxy-benzylamino)-9H-purin-2-yl]-piperazin-1-yl}-ethanol | CHEMBL78227
TypeSmall organic molecule
Emp. Form.C22H31N7O2
Mol. Mass.425.5272
SMILESCOc1ccc(CNc2nc(nc3n(cnc23)C(C)C)N2CCN(CCO)CC2)cc1