Reaction Details
TargetProthrombin
LigandBDBM50113796
Substrate/Competitorn/a
Meas. Tech.ChEMBL_208531 (CHEMBL813625)
Ki 9.8±n/a nM
Citation Danilewicz, JCAbel, SMBrown, ADFish, PVHawkeswood, EHolland, SJJames, KMcElroy, ABOverington, JPowling, MJRance, DJ Design of selective thrombin inhibitors based on the (R)-Phe-Pro-Arg sequence. J Med Chem45:2432-53 (2002) Prothrombin
Name:Prothrombin
Type:Protein
Mol. Mass.:70029.57
Organism:Homo sapiens (Human)
Description:P00734
Residue:622
BDBM50113796
NameBDBM50113796
Synonyms:CHEMBL418923 | S-4-{2-[2-(1-Carbamimidoyl-piperidin-4-yloxy)-ethyl]-piperidin-1-yl}-3-(1-ethyl-propylamino)-4-oxo-butyric acid
TypeSmall organic molecule
Emp. Form.C22H41N5O4
Mol. Mass.439.592
SMILESCCC(CC)N[C@@H](CC(O)=O)C(=O)N1CCCC[C@H]1CCOC1CCN(CC1)C(N)=N