Reaction Details
TargetProthrombin
LigandBDBM50113798
Substrate/Competitorn/a
Meas. Tech.ChEMBL_208531 (CHEMBL813625)
Ki 7.1±n/a nM
Citation Danilewicz, JCAbel, SMBrown, ADFish, PVHawkeswood, EHolland, SJJames, KMcElroy, ABOverington, JPowling, MJRance, DJ Design of selective thrombin inhibitors based on the (R)-Phe-Pro-Arg sequence. J Med Chem45:2432-53 (2002) Prothrombin
Name:Prothrombin
Type:Protein
Mol. Mass.:70029.57
Organism:Homo sapiens (Human)
Description:P00734
Residue:622
BDBM50113798
NameBDBM50113798
Synonyms:CHEMBL82535 | RS-4-{2-[2-(1-Carbamimidoyl-piperidin-4-yloxy)-ethyl]-piperidin-1-yl}-3-cyclohexylamino-4-oxo-butyric acid
TypeSmall organic molecule
Emp. Form.C23H41N5O4
Mol. Mass.451.6027
SMILESNC(=N)N1CCC(CC1)OCCC1CCCCN1C(=O)[C@H](CC(O)=O)NC1CCCCC1