Reaction Details
TargetSerine protease 1
LigandBDBM50113802
Substrate/Competitorn/a
Meas. Tech.ChEMBL_212873 (CHEMBL817823)
Ki 550±n/a nM
Citation Danilewicz, JCAbel, SMBrown, ADFish, PVHawkeswood, EHolland, SJJames, KMcElroy, ABOverington, JPowling, MJRance, DJ Design of selective thrombin inhibitors based on the (R)-Phe-Pro-Arg sequence. J Med Chem45:2432-53 (2002) Serine protease 1
Name:Serine protease 1
Type:Enzyme
Mol. Mass.:26557.80
Organism:Homo sapiens (Human)
Description:P07477
Residue:247
BDBM50113802
NameBDBM50113802
Synonyms:5-{2-[2-(1-Carbamimidoyl-piperidin-4-yloxy)-ethyl]-piperidin-1-yl}-4-(cyclohexyl-methyl-amino)-5-oxo-pentanoic acid | CHEMBL312647
TypeSmall organic molecule
Emp. Form.C25H45N5O4
Mol. Mass.479.6559
SMILESCN([C@@H](CCC(O)=O)C(=O)N1CCCC[C@H]1CCOC1CCN(CC1)C(N)=N)C1CCCCC1