Reaction Details
TargetSerine protease 1
LigandBDBM50114448
Substrate/Competitorn/a
Meas. Tech.ChEMBL_212715 (CHEMBL818174)
IC50>11000±n/a nM
Citation Jia, ZJWu, YHuang, WGoldman, EZhang, PWoolfrey, JWong, PHuang, BSinha, UPark, GReed, AScarborough, RMZhu, BY Design, synthesis and biological activity of novel non-amidine factor Xa inhibitors. Part 1: P(1) structure-activity relationships of the substituted 1-(2-Naphthyl)-1H-pyrazole-5-carboxylamides. Bioorg Med Chem Lett12:1651-5 (2002) Serine protease 1
Name:Serine protease 1
Type:Enzyme
Mol. Mass.:26557.80
Organism:Homo sapiens (Human)
Description:P07477
Residue:247
BDBM50114448
NameBDBM50114448
Synonyms:2-[3-(4,5-Dihydro-1H-imidazol-2-yl)-naphthalen-2-yl]-5-methyl-2H-pyrazole-3-carboxylic acid (2'-sulfamoyl-biphenyl-4-yl)-amide | CHEMBL295297
TypeSmall organic molecule
Emp. Form.C30H26N6O3S
Mol. Mass.550.631
SMILESCc1cc(C(=O)Nc2ccc(cc2)-c2ccccc2S(N)(=O)=O)n(n1)-c1cc2ccccc2cc1C1=NCCN1