Reaction Details
TargetCoagulation factor X
LigandBDBM50114451
Substrate/Competitorn/a
Meas. Tech.ChEBML_49164
IC50 27±n/a nM
Citation Jia, ZJWu, YHuang, WGoldman, EZhang, PWoolfrey, JWong, PHuang, BSinha, UPark, GReed, AScarborough, RMZhu, BY Design, synthesis and biological activity of novel non-amidine factor Xa inhibitors. Part 1: P(1) structure-activity relationships of the substituted 1-(2-Naphthyl)-1H-pyrazole-5-carboxylamides. Bioorg Med Chem Lett12:1651-5 (2002) Coagulation factor X
Name:Coagulation factor X
Type:Enzyme
Mol. Mass.:54726.60
Organism:Homo sapiens (Human)
Description:n/a
Residue:488
BDBM50114451
NameBDBM50114451
Synonyms:2-(3-Fluoro-naphthalen-2-yl)-5-trifluoromethyl-2H-pyrazole-3-carboxylic acid (2'-sulfamoyl-biphenyl-4-yl)-amide | CHEMBL44277
TypeSmall organic molecule
Emp. Form.C27H18F4N4O3S
Mol. Mass.554.515
SMILESNS(=O)(=O)c1ccccc1-c1ccc(NC(=O)c2cc(nn2-c2cc3ccccc3cc2F)C(F)(F)F)cc1