Reaction Details
TargetCoagulation factor X
LigandBDBM50114443
Substrate/Competitorn/a
Meas. Tech.ChEBML_49164
IC50 24±n/a nM
Citation Jia, ZJWu, YHuang, WGoldman, EZhang, PWoolfrey, JWong, PHuang, BSinha, UPark, GReed, AScarborough, RMZhu, BY Design, synthesis and biological activity of novel non-amidine factor Xa inhibitors. Part 1: P(1) structure-activity relationships of the substituted 1-(2-Naphthyl)-1H-pyrazole-5-carboxylamides. Bioorg Med Chem Lett12:1651-5 (2002) Coagulation factor X
Name:Coagulation factor X
Type:Enzyme
Mol. Mass.:54726.60
Organism:Homo sapiens (Human)
Description:n/a
Residue:488
BDBM50114443
NameBDBM50114443
Synonyms:5-Methyl-2-(3-sulfamoyl-naphthalen-2-yl)-2H-pyrazole-3-carboxylic acid (2'-sulfamoyl-biphenyl-4-yl)-amide | CHEMBL295034
TypeSmall organic molecule
Emp. Form.C27H23N5O5S2
Mol. Mass.561.632
SMILESCc1cc(C(=O)Nc2ccc(cc2)-c2ccccc2S(N)(=O)=O)n(n1)-c1cc2ccccc2cc1S(N)(=O)=O