Reaction Details
TargetPlasminogen
LigandBDBM50114455
Substrate/Competitorn/a
Meas. Tech.ChEBML_155419
IC50 13000±n/a nM
Citation Zhang, PZuckett, JFWoolfrey, JTran, KHuang, BWong, PSinha, UPark, GReed, AMalinowski, JHollenbach, SScarborough, RMZhu, BY Design, synthesis, and SAR of monobenzamidines and aminoisoquinolines as factor Xa inhibitors. Bioorg Med Chem Lett12:1657-61 (2002) Plasminogen
Name:Plasminogen
Type:Enzyme
Mol. Mass.:90579.18
Organism:Homo sapiens (Human)
Description:n/a
Residue:810
BDBM50114455
NameBDBM50114455
Synonyms:2'-Sulfamoyl-biphenyl-4-carboxylic acid [2-(3-carbamimidoyl-phenoxy)-ethyl]-amide | CHEMBL432306
TypeSmall organic molecule
Emp. Form.C22H22N4O4S
Mol. Mass.438.499
SMILESNC(=N)c1cccc(OCCNC(=O)c2ccc(cc2)-c2ccccc2S(N)(=O)=O)c1