Reaction Details
TargetCoagulation factor X
LigandBDBM50114462
Substrate/Competitorn/a
Meas. Tech.ChEBML_48983
IC50 12±n/a nM
Citation Zhang, PZuckett, JFWoolfrey, JTran, KHuang, BWong, PSinha, UPark, GReed, AMalinowski, JHollenbach, SScarborough, RMZhu, BY Design, synthesis, and SAR of monobenzamidines and aminoisoquinolines as factor Xa inhibitors. Bioorg Med Chem Lett12:1657-61 (2002) Coagulation factor X
Name:Coagulation factor X
Type:Enzyme
Mol. Mass.:54726.60
Organism:Homo sapiens (Human)
Description:n/a
Residue:488
BDBM50114462
NameBDBM50114462
Synonyms:2-(3-Carbamimidoyl-phenoxy)-4-methylamino-N-(2'-sulfamoyl-biphenyl-4-yl)-benzamide | CHEMBL48131
TypeSmall organic molecule
Emp. Form.C27H25N5O4S
Mol. Mass.515.583
SMILESCNc1ccc(C(=O)Nc2ccc(cc2)-c2ccccc2S(N)(=O)=O)c(Oc2cccc(c2)C(N)=N)c1