Reaction Details
TargetCoagulation factor X
LigandBDBM50114484
Substrate/Competitorn/a
Meas. Tech.ChEBML_48983
IC50 1320±n/a nM
Citation Zhang, PZuckett, JFWoolfrey, JTran, KHuang, BWong, PSinha, UPark, GReed, AMalinowski, JHollenbach, SScarborough, RMZhu, BY Design, synthesis, and SAR of monobenzamidines and aminoisoquinolines as factor Xa inhibitors. Bioorg Med Chem Lett12:1657-61 (2002) Coagulation factor X
Name:Coagulation factor X
Type:Enzyme
Mol. Mass.:54726.60
Organism:Homo sapiens (Human)
Description:n/a
Residue:488
BDBM50114484
NameBDBM50114484
Synonyms:2'-Sulfamoyl-biphenyl-4-carboxylic acid [2-(1-amino-isoquinolin-7-yloxy)-5-fluoro-phenyl]-amide | CHEMBL433066
TypeSmall organic molecule
Emp. Form.C28H21FN4O4S
Mol. Mass.528.554
SMILESNc1nccc2ccc(Oc3ccc(F)cc3NC(=O)c3ccc(cc3)-c3ccccc3S(N)(=O)=O)cc12