Reaction Details
TargetCoagulation factor X
LigandBDBM50114492
Substrate/Competitorn/a
Meas. Tech.ChEBML_48983
IC50 22±n/a nM
Citation Zhang, PZuckett, JFWoolfrey, JTran, KHuang, BWong, PSinha, UPark, GReed, AMalinowski, JHollenbach, SScarborough, RMZhu, BY Design, synthesis, and SAR of monobenzamidines and aminoisoquinolines as factor Xa inhibitors. Bioorg Med Chem Lett12:1657-61 (2002) Coagulation factor X
Name:Coagulation factor X
Type:Enzyme
Mol. Mass.:54726.60
Organism:Homo sapiens (Human)
Description:n/a
Residue:488
BDBM50114492
NameBDBM50114492
Synonyms:2-{2-[2-(1-Amino-isoquinolin-7-yloxy)-ethyl]-1-oxo-2,3-dihydro-1H-isoindol-5-yl}-benzenesulfonamide | CHEMBL46653
TypeSmall organic molecule
Emp. Form.C25H22N4O4S
Mol. Mass.474.532
SMILESNc1nccc2ccc(OCCN3Cc4cc(ccc4C3=O)-c3ccccc3S(N)(=O)=O)cc12