Reaction Details
TargetBeta-lactamase
LigandBDBM50114501
Substrate/Competitorn/a
Meas. Tech.ChEBML_47852
IC50 22±n/a nM
Citation Buynak, JDVogeti, LDoppalapudi, VRSolomon, GMChen, H Cephalosporin-derived inhibitors of beta-lactamase. Part 4: The C3 substituent. Bioorg Med Chem Lett12:1663-6 (2002) Beta-lactamase
Name:Beta-lactamase
Type:PROTEIN
Mol. Mass.:41306.67
Organism:Enterobacter cloacae
Description:ChEMBL_40258
Residue:381
BDBM50114501
NameBDBM50114501
Synonyms:CHEMBL289979 | Sodium; (R)-3-((E)-2-carbamoyl-vinyl)-5,5,8-trioxo-7-[1-pyridin-2-yl-meth-(Z)-ylidene]-5lambda*6*-thia-1-aza-bicyclo[4.2.0]oct-2-ene-2-carboxylate
TypeSmall organic molecule
Emp. Form.C16H12N3O6S
Mol. Mass.374.349
SMILESNC(=O)\C=C\C1=C(N2[C@@H](\C(=C/c3ccccn3)C2=O)S(=O)(=O)C1)C([O-])=O