Reaction Details
TargetBeta-lactamase
LigandBDBM50114504
Substrate/Competitorn/a
Meas. Tech.ChEBML_47852
IC50 4.7±n/a nM
Citation Buynak, JDVogeti, LDoppalapudi, VRSolomon, GMChen, H Cephalosporin-derived inhibitors of beta-lactamase. Part 4: The C3 substituent. Bioorg Med Chem Lett12:1663-6 (2002) Beta-lactamase
Name:Beta-lactamase
Type:PROTEIN
Mol. Mass.:41306.67
Organism:Enterobacter cloacae
Description:ChEMBL_40258
Residue:381
BDBM50114504
NameBDBM50114504
Synonyms:CHEMBL45084 | Sodium; (R)-3-iodo-5,5,8-trioxo-7-[1-pyridin-2-yl-meth-(Z)-ylidene]-5lambda*6*-thia-1-aza-bicyclo[4.2.0]oct-2-ene-2-carboxylate
TypeSmall organic molecule
Emp. Form.C13H8IN2O5S
Mol. Mass.431.183
SMILES[O-]C(=O)C1=C(I)CS(=O)(=O)[C@H]2N1C(=O)\C2=C\c1ccccn1