Reaction Details
TargetBeta-lactamase
LigandBDBM50114523
Substrate/Competitorn/a
Meas. Tech.ChEBML_47852
IC50 40±n/a nM
Citation Buynak, JDVogeti, LDoppalapudi, VRSolomon, GMChen, H Cephalosporin-derived inhibitors of beta-lactamase. Part 4: The C3 substituent. Bioorg Med Chem Lett12:1663-6 (2002) Beta-lactamase
Name:Beta-lactamase
Type:PROTEIN
Mol. Mass.:41306.67
Organism:Enterobacter cloacae
Description:ChEMBL_40258
Residue:381
BDBM50114523
NameBDBM50114523
Synonyms:CHEMBL45273 | Sodium; (R)-5,5,8-trioxo-7-[1-pyridin-2-yl-meth-(Z)-ylidene]-3-thiophen-2-yl-5lambda*6*-thia-1-aza-bicyclo[4.2.0]oct-2-ene-2-carboxylate
TypeSmall organic molecule
Emp. Form.C17H11N2O5S2
Mol. Mass.387.41
SMILES[O-]C(=O)C1=C(CS(=O)(=O)[C@H]2N1C(=O)\C2=C\c1ccccn1)c1cccs1