Reaction Details
TargetSerine protease 1
LigandBDBM50114540
Substrate/Competitorn/a
Meas. Tech.ChEBML_212859
Ki 52±n/a nM
Citation Guertin, KRGardner, CJKlein, SIZulli, ALCzekaj, MGong, YSpada, APCheney, DLMaignan, SGuilloteau, JPBrown, KDColussi, DJChu, VHeran, CLMorgan, SRBentley, RGDunwiddie, CTLeadley, RJPauls, HW Optimization of the beta-aminoester class of factor Xa inhibitors. Part 2: Identification of FXV673 as a potent and selective inhibitor with excellent In vivo anticoagulant activity. Bioorg Med Chem Lett12:1671-4 (2002) Serine protease 1
Name:Serine protease 1
Type:Enzyme
Mol. Mass.:26557.80
Organism:Homo sapiens (Human)
Description:P07477
Residue:247
BDBM50114540
NameBDBM50114540
Synonyms:3-{4-[(1R,2R)-3-(3-Carbamimidoyl-phenyl)-2-methoxycarbonyl-1-methyl-propylcarbamoyl]-phenyl}-1-methyl-pyridinium | CHEMBL295454
TypeSmall organic molecule
Emp. Form.C26H29N4O3
Mol. Mass.445.5329
SMILESCOC(=O)[C@H](Cc1cccc(c1)C(N)=N)[C@@H](C)NC(=O)c1ccc(cc1)-c1ccc[n+](C)c1