Reaction Details
TargetCoagulation factor X
LigandBDBM50114548
Substrate/Competitorn/a
Meas. Tech.ChEBML_49305
Ki 1.2±n/a nM
Citation Guertin, KRGardner, CJKlein, SIZulli, ALCzekaj, MGong, YSpada, APCheney, DLMaignan, SGuilloteau, JPBrown, KDColussi, DJChu, VHeran, CLMorgan, SRBentley, RGDunwiddie, CTLeadley, RJPauls, HW Optimization of the beta-aminoester class of factor Xa inhibitors. Part 2: Identification of FXV673 as a potent and selective inhibitor with excellent In vivo anticoagulant activity. Bioorg Med Chem Lett12:1671-4 (2002) Coagulation factor X
Name:Coagulation factor X
Type:Enzyme
Mol. Mass.:54726.60
Organism:Homo sapiens (Human)
Description:n/a
Residue:488
BDBM50114548
NameBDBM50114548
Synonyms:2-{4-[(1R,2R)-3-(3-Carbamimidoyl-phenyl)-2-methoxycarbonyl-1-methyl-propylcarbamoyl]-phenyl}-1-methyl-pyridinium | CHEMBL44586
TypeSmall organic molecule
Emp. Form.C26H29N4O3
Mol. Mass.445.5329
SMILESCOC(=O)[C@H](Cc1cccc(c1)C(N)=N)[C@@H](C)NC(=O)c1ccc(cc1)-c1cccc[n+]1C