Reaction Details
TargetCannabinoid receptor 1
LigandBDBM50114679
Substrate/Competitorn/a
Meas. Tech.ChEMBL_46637 (CHEMBL658893)
Ki 35.5±n/a nM
Citation Francisco, MESeltzman, HHGilliam, AFMitchell, RARider, SLPertwee, RGStevenson, LAThomas, BF Synthesis and structure-activity relationships of amide and hydrazide analogues of the cannabinoid CB(1) receptor antagonist N-(piperidinyl)- 5-(4-chlorophenyl)-1-(2,4-dichlorophenyl)-4-methyl-1H-pyrazole-3-carboxamide (SR141716). J Med Chem45:2708-19 (2002) Cannabinoid receptor 1
Name:Cannabinoid receptor 1
Type:G Protein-Coupled Receptor (GPCR)
Mol. Mass.:52856.55
Organism:Rattus norvegicus (rat)
Description:P20272
Residue:473
BDBM50114679
NameBDBM50114679
Synonyms:5-(4-Chloro-phenyl)-1-(2,4-dichloro-phenyl)-4-methyl-1H-pyrazole-3-carboxylic acid N'-isobutyl-hydrazide | CHEMBL327587
TypeSmall organic molecule
Emp. Form.C21H21Cl3N4O
Mol. Mass.451.777
SMILESCC(C)CNNC(=O)c1nn(c(c1C)-c1ccc(Cl)cc1)-c1ccc(Cl)cc1Cl