Reaction Details
TargetMelatonin receptor type 1B
LigandBDBM50114716
Substrate/Competitorn/a
Meas. Tech.ChEMBL_105263 (CHEMBL715855)
Ki 0.05±n/a nM
Citation Wallez, VDurieux-Poissonnier, SChavatte, PBoutin, JAAudinot, VNicolas, JPBennejean, CDelagrange, PRenard, PLesieur, D Synthesis and structure-affinity-activity relationships of novel benzofuran derivatives as MT(2) melatonin receptor selective ligands. J Med Chem45:2788-800 (2002) Melatonin receptor type 1B
Name:Melatonin receptor type 1B
Type:Enzyme
Mol. Mass.:40203.54
Organism:Homo sapiens (Human)
Description:P49286
Residue:362
BDBM50114716
NameBDBM50114716
Synonyms:CHEMBL329263 | N-[2-(2-Benzyl-5-methoxy-benzofuran-3-yl)-ethyl]-acetamide
TypeSmall organic molecule
Emp. Form.C20H21NO3
Mol. Mass.323.3856
SMILESCOc1ccc2oc(Cc3ccccc3)c(CCNC(C)=O)c2c1