Reaction Details
TargetMelatonin receptor type 1B
LigandBDBM50114701
Substrate/Competitorn/a
Meas. Tech.ChEMBL_105263 (CHEMBL715855)
Ki 0.11±n/a nM
Citation Wallez, VDurieux-Poissonnier, SChavatte, PBoutin, JAAudinot, VNicolas, JPBennejean, CDelagrange, PRenard, PLesieur, D Synthesis and structure-affinity-activity relationships of novel benzofuran derivatives as MT(2) melatonin receptor selective ligands. J Med Chem45:2788-800 (2002) Melatonin receptor type 1B
Name:Melatonin receptor type 1B
Type:Enzyme
Mol. Mass.:40203.54
Organism:Homo sapiens (Human)
Description:P49286
Residue:362
BDBM50114701
NameBDBM50114701
Synonyms:But-3-enoic acid {2-[5-methoxy-2-(3-methoxy-benzyl)-benzofuran-3-yl]-ethyl}-amide | CHEMBL329086
TypeSmall organic molecule
Emp. Form.C23H25NO4
Mol. Mass.379.4489
SMILESCOc1cccc(Cc2oc3ccc(OC)cc3c2CCNC(=O)CC=C)c1