Reaction Details
TargetMelatonin receptor type 1B
LigandBDBM50114707
Substrate/Competitorn/a
Meas. Tech.ChEMBL_105263 (CHEMBL715855)
Ki 0.06±n/a nM
Citation Wallez, VDurieux-Poissonnier, SChavatte, PBoutin, JAAudinot, VNicolas, JPBennejean, CDelagrange, PRenard, PLesieur, D Synthesis and structure-affinity-activity relationships of novel benzofuran derivatives as MT(2) melatonin receptor selective ligands. J Med Chem45:2788-800 (2002) Melatonin receptor type 1B
Name:Melatonin receptor type 1B
Type:Enzyme
Mol. Mass.:40203.54
Organism:Homo sapiens (Human)
Description:P49286
Residue:362
BDBM50114707
NameBDBM50114707
Synonyms:But-3-enoic acid [2-(2-benzyl-5-methoxy-benzofuran-3-yl)-ethyl]-amide | CHEMBL97186
TypeSmall organic molecule
Emp. Form.C22H23NO3
Mol. Mass.349.4229
SMILESCOc1ccc2oc(Cc3ccccc3)c(CCNC(=O)CC=C)c2c1