Reaction Details
TargetMelatonin receptor type 1B
LigandBDBM50114720
Substrate/Competitorn/a
Meas. Tech.ChEMBL_105263 (CHEMBL715855)
Ki 0.21±n/a nM
Citation Wallez, VDurieux-Poissonnier, SChavatte, PBoutin, JAAudinot, VNicolas, JPBennejean, CDelagrange, PRenard, PLesieur, D Synthesis and structure-affinity-activity relationships of novel benzofuran derivatives as MT(2) melatonin receptor selective ligands. J Med Chem45:2788-800 (2002) Melatonin receptor type 1B
Name:Melatonin receptor type 1B
Type:Enzyme
Mol. Mass.:40203.54
Organism:Homo sapiens (Human)
Description:P49286
Residue:362
BDBM50114720
NameBDBM50114720
Synonyms:But-2-enoic acid [2-(5-methoxy-2-phenyl-benzofuran-3-yl)-ethyl]-amide | CHEMBL96104
TypeSmall organic molecule
Emp. Form.C21H21NO3
Mol. Mass.335.3963
SMILESCOc1ccc2oc(c(CCNC(=O)\C=C\C)c2c1)-c1ccccc1