Reaction Details
TargetMelatonin receptor type 1B
LigandBDBM50114712
Substrate/Competitorn/a
Meas. Tech.ChEMBL_105263 (CHEMBL715855)
Ki 0.2±n/a nM
Citation Wallez, VDurieux-Poissonnier, SChavatte, PBoutin, JAAudinot, VNicolas, JPBennejean, CDelagrange, PRenard, PLesieur, D Synthesis and structure-affinity-activity relationships of novel benzofuran derivatives as MT(2) melatonin receptor selective ligands. J Med Chem45:2788-800 (2002) Melatonin receptor type 1B
Name:Melatonin receptor type 1B
Type:Enzyme
Mol. Mass.:40203.54
Organism:Homo sapiens (Human)
Description:P49286
Residue:362
BDBM50114712
NameBDBM50114712
Synonyms:CHEMBL96859 | N-[2-(2-Benzyl-5-methoxy-benzofuran-3-yl)-ethyl]-butyramide
TypeSmall organic molecule
Emp. Form.C22H25NO3
Mol. Mass.351.4388
SMILESCCCC(=O)NCCc1c(Cc2ccccc2)oc2ccc(OC)cc12