Reaction Details
TargetMelatonin receptor type 1B
LigandBDBM50114703
Substrate/Competitorn/a
Meas. Tech.ChEMBL_105263 (CHEMBL715855)
Ki 0.02±n/a nM
Citation Wallez, VDurieux-Poissonnier, SChavatte, PBoutin, JAAudinot, VNicolas, JPBennejean, CDelagrange, PRenard, PLesieur, D Synthesis and structure-affinity-activity relationships of novel benzofuran derivatives as MT(2) melatonin receptor selective ligands. J Med Chem45:2788-800 (2002) Melatonin receptor type 1B
Name:Melatonin receptor type 1B
Type:Enzyme
Mol. Mass.:40203.54
Organism:Homo sapiens (Human)
Description:P49286
Residue:362
BDBM50114703
NameBDBM50114703
Synonyms:CHEMBL287560 | N-[2-(5-Methoxy-2-phenyl-benzofuran-3-yl)-ethyl]-acetamide
TypeSmall organic molecule
Emp. Form.C19H19NO3
Mol. Mass.309.3591
SMILESCOc1ccc2oc(c(CCNC(C)=O)c2c1)-c1ccccc1