Reaction Details
TargetMelatonin receptor type 1B
LigandBDBM9019
Substrate/Competitorn/a
Meas. Tech.ChEMBL_105263 (CHEMBL715855)
Ki 0.31±n/a nM
Citation Wallez, VDurieux-Poissonnier, SChavatte, PBoutin, JAAudinot, VNicolas, JPBennejean, CDelagrange, PRenard, PLesieur, D Synthesis and structure-affinity-activity relationships of novel benzofuran derivatives as MT(2) melatonin receptor selective ligands. J Med Chem45:2788-800 (2002) Melatonin receptor type 1B
Name:Melatonin receptor type 1B
Type:Enzyme
Mol. Mass.:40203.54
Organism:Homo sapiens (Human)
Description:P49286
Residue:362
BDBM9019
NameBDBM9019
Synonyms:CHEMBL45 N-[2-(5-methoxy-1H-indol-3-yl)ethyl]acetamide
TypeSmall organic molecule
Emp. Form.C13H16N2O2
Mol. Mass.232.2783
SMILESCOc1ccc2[nH]cc(CCNC(C)=O)c2c1