Reaction Details
TargetNeuronal acetylcholine receptor subunit alpha-4/beta-2
LigandBDBM50114754
Substrate/Competitorn/a
Meas. Tech.ChEMBL_143415 (CHEMBL750057)
Ki 0.47±n/a nM
Citation Zhang, NTomizawa, MCasida, JE Structural features of azidopyridinyl neonicotinoid probes conferring high affinity and selectivity for mammalian alpha4beta2 and Drosophila nicotinic receptors. J Med Chem45:2832-40 (2002) Neuronal acetylcholine receptor subunit alpha-4/beta-2
Name:Neuronal acetylcholine receptor subunit alpha-4/beta-2
Type:Protein
Mol. Mass.:n/a
Description:n/a
Components:This complex has 2 components.
Component 1
Name:Neuronal acetylcholine receptor subunit alpha-4
Synonyms:ACHA4_HUMAN CHRNA4 protein Neuronal acetylcholine receptor protein alpha-4 subunit Nicotinic acetylcholine receptor alpha4/beta2/alpha5
Type:n/a
Mol. Mass.:69963.49
Organism:Homo sapiens (Human)
Description:NACHRA4
Residue:627
Component 2
Name:Neuronal acetylcholine receptor subunit beta-2
Synonyms:ACHB2_HUMAN Neuronal acetylcholine receptor protein beta-2 subunit | Nicotinic acetylcholine receptor alpha3/beta2/alpha5
Type:Protein
Mol. Mass.:57020.50
Organism:Homo sapiens (Human)
Description:P17787
Residue:502
BDBM50114754
NameBDBM50114754
Synonyms:3-(5-Azido-6-chloro-pyridin-3-ylmethyl)-3H-thiazol-2-ylideneamine | CHEMBL319885
TypeSmall organic molecule
Emp. Form.C9H7ClN6S
Mol. Mass.266.71
SMILESClc1ncc(Cn2ccsc2=N)cc1N=[N+]=[N-]