Reaction Details
TargetHistone deacetylase 1
LigandBDBM50114811
Substrate/Competitorn/a
Meas. Tech.ChEMBL_87852 (CHEMBL701992)
IC50 4.5±n/a nM
Citation Woo, SHFrechette, SAbou Khalil, EBouchain, GVaisburg, ABernstein, NMoradei, OLeit, SAllan, MFournel, MTrachy-Bourget, MCLi, ZBesterman, JMDelorme, D Structurally simple trichostatin A-like straight chain hydroxamates as potent histone deacetylase inhibitors. J Med Chem45:2877-85 (2002) Histone deacetylase 1
Name:Histone deacetylase 1
Type:Enzyme
Mol. Mass.:55090.27
Organism:Homo sapiens (Human)
Description:Q13547
Residue:482
BDBM50114811
NameBDBM50114811
Synonyms:8-Oxo-8-[4-(4-phenyl-piperazin-1-yl)-phenyl]-octanoic acid hydroxyamide N-hydroxy-8-oxo-8-(4-(4-phenylpiperazin-1-yl)phenyl)octanamide
TypeSmall organic molecule
Emp. Form.C24H31N3O3
Mol. Mass.409.5212
SMILESONC(=O)CCCCCCC(=O)c1ccc(cc1)N1CCN(CC1)c1ccccc1