Reaction Details
TargetHistone deacetylase 1
LigandBDBM50114827
Substrate/Competitorn/a
Meas. Tech.ChEMBL_87852 (CHEMBL701992)
IC50 35±n/a nM
Citation Woo, SHFrechette, SAbou Khalil, EBouchain, GVaisburg, ABernstein, NMoradei, OLeit, SAllan, MFournel, MTrachy-Bourget, MCLi, ZBesterman, JMDelorme, D Structurally simple trichostatin A-like straight chain hydroxamates as potent histone deacetylase inhibitors. J Med Chem45:2877-85 (2002) Histone deacetylase 1
Name:Histone deacetylase 1
Type:Enzyme
Mol. Mass.:55090.27
Organism:Homo sapiens (Human)
Description:Q13547
Residue:482
BDBM50114827
NameBDBM50114827
Synonyms:7-Naphthalen-2-yl-7-oxo-heptanoic acid hydroxyamide N-hydroxy-7-(naphthalen-2-yl)-7-oxoheptanamide
TypeSmall organic molecule
Emp. Form.C17H19NO3
Mol. Mass.285.3377
SMILESONC(=O)CCCCCC(=O)c1ccc2ccccc2c1