Reaction Details
TargetEndothelin-converting enzyme 1
LigandBDBM50114912
Substrate/Competitorn/a
Meas. Tech.ChEBML_64361
IC50 2700±n/a nM
Citation Kitas, EALöffler, BMDaetwyler, SDehmlow, HAebi, JD Synthesis of triazole-Tethered pyrrolidine libraries: novel ECE inhibitors. Bioorg Med Chem Lett12:1727-30 (2002) Endothelin-converting enzyme 1
Name:Endothelin-converting enzyme 1
Type:Enzyme
Mol. Mass.:87155.11
Organism:Homo sapiens (Human)
Description:P42892
Residue:770
BDBM50114912
NameBDBM50114912
Synonyms:(2S,4R)-4-Mercapto-2-(5-methylsulfanyl-4-phenyl-4H-[1,2,4]triazol-3-yl)-pyrrolidine-1-carboxylic acid butyl ester | CHEMBL49451
TypeSmall organic molecule
Emp. Form.C18H24N4O2S2
Mol. Mass.392.539
SMILESCCCCOC(=O)N1C[C@H](S)C[C@H]1c1nnc(SC)n1-c1ccccc1