Reaction Details
TargetSubstance-P receptor
LigandBDBM50114941
Substrate/Competitorn/a
Meas. Tech.ChEBML_205739
IC50 1.7±n/a nM
Citation Elliott, JMCastro, JLChicchi, GGCooper, LCDinnell, KHollingworth, GJRidgill, MPRycroft, WKurtz, MMShaw, DESwain, CJTsao, KLYang, L 4,4-Disubstituted cyclohexylamine NK(1) receptor antagonists I. Bioorg Med Chem Lett12:1755-8 (2002) Substance-P receptor
Name:Substance-P receptor
Type:G Protein-Coupled Receptor (GPCR)
Mol. Mass.:46254.43
Organism:Homo sapiens (Human)
Description:P25103
Residue:407
BDBM50114941
NameBDBM50114941
Synonyms:(3,5-Bis-trifluoromethyl-benzyl)-{4-[4-(4-fluoro-phenyl)-piperidin-1-yl]-1-phenyl-cyclohexylmethyl}-amine | CHEMBL45859
TypeSmall organic molecule
Emp. Form.C33H35F7N2
Mol. Mass.592.6332
SMILESFc1ccc(cc1)C1CCN(CC1)C1CCC(CNCc2cc(cc(c2)C(F)(F)F)C(F)(F)F)(CC1)c1ccccc1