Reaction Details
TargetSubstance-P receptor
LigandBDBM50114938
Substrate/Competitorn/a
Meas. Tech.ChEBML_205739
IC50 0.700000±n/a nM
Citation Elliott, JMCastro, JLChicchi, GGCooper, LCDinnell, KHollingworth, GJRidgill, MPRycroft, WKurtz, MMShaw, DESwain, CJTsao, KLYang, L 4,4-Disubstituted cyclohexylamine NK(1) receptor antagonists I. Bioorg Med Chem Lett12:1755-8 (2002) Substance-P receptor
Name:Substance-P receptor
Type:G Protein-Coupled Receptor (GPCR)
Mol. Mass.:46254.43
Organism:Homo sapiens (Human)
Description:P25103
Residue:407
BDBM50114938
NameBDBM50114938
Synonyms:2-(3,5-Bis-trifluoromethyl-phenyl)-N-{4-[4-(4-fluoro-phenyl)-piperidin-1-yl]-1-phenyl-cyclohexyl}-acetamide | CHEMBL444836
TypeSmall organic molecule
Emp. Form.C33H33F7N2O
Mol. Mass.606.6167
SMILESFc1ccc(cc1)C1CCN(CC1)C1CCC(CC1)(NC(=O)Cc1cc(cc(c1)C(F)(F)F)C(F)(F)F)c1ccccc1