Reaction Details
TargetSubstance-P receptor
LigandBDBM50114937
Substrate/Competitorn/a
Meas. Tech.ChEMBL_205739 (CHEMBL812171)
IC50 0.350±n/a nM
Citation Elliott, JMCastro, JLChicchi, GGCooper, LCDinnell, KHollingworth, GJRidgill, MPRycroft, WKurtz, MMShaw, DESwain, CJTsao, KLYang, L 4,4-Disubstituted cyclohexylamine NK(1) receptor antagonists I. Bioorg Med Chem Lett12:1755-8 (2002) Substance-P receptor
Name:Substance-P receptor
Type:G Protein-Coupled Receptor (GPCR)
Mol. Mass.:46254.43
Organism:Homo sapiens (Human)
Description:P25103
Residue:407
BDBM50114937
NameBDBM50114937
Synonyms:4-[4-(4-Fluoro-phenyl)-piperidin-1-yl]-1-phenyl-cyclohexanecarboxylic acid [1-(3,5-bis-trifluoromethyl-phenyl)-ethyl]-amide | CHEMBL49176
TypeSmall organic molecule
Emp. Form.C34H35F7N2O
Mol. Mass.620.6433
SMILESCC(NC(=O)[C@]1(CC[C@@H](CC1)N1CCC(CC1)c1ccc(F)cc1)c1ccccc1)c1cc(cc(c1)C(F)(F)F)C(F)(F)F