Reaction Details
TargetSubstance-P receptor
LigandBDBM50114952
Substrate/Competitorn/a
Meas. Tech.ChEMBL_205711 (CHEMBL807958)
IC50 0.260000±n/a nM
Citation Cooper, LCCarlson, EJCastro, JLChicchi, GGDinnell, KDi Salvo, JElliott, JMHollingworth, GJKurtz, MMRidgill, MPRycroft, WTsao, KLSwain, CJ 4,4-Disubstituted cyclohexylamine NK(1) receptor antagonists II. Bioorg Med Chem Lett12:1759-62 (2002) Substance-P receptor
Name:Substance-P receptor
Type:G Protein-Coupled Receptor (GPCR)
Mol. Mass.:46254.43
Organism:Homo sapiens (Human)
Description:P25103
Residue:407
BDBM50114952
NameBDBM50114952
Synonyms:2-(3,5-Bis-trifluoromethyl-phenyl)-N-[4-(1,1-dimethyl-2-oxa-8-aza-spiro[4.5]dec-8-yl)-1-phenyl-cyclohexyl]-propionamide | CHEMBL3085131
TypeSmall organic molecule
Emp. Form.C34H42F6N2O2
Mol. Mass.624.6999
SMILESCC(C(=O)N[C@@]1(CC[C@@H](CC1)N1CCC(CC1)C1CCOC1(C)C)c1ccccc1)c1cc(cc(c1)C(F)(F)F)C(F)(F)F