Reaction Details
TargetPotassium voltage-gated channel subfamily H member 2
LigandBDBM50114954
Substrate/Competitorn/a
Meas. Tech.ChEBML_205711
Ki 400±n/a nM
Citation Cooper, LCCarlson, EJCastro, JLChicchi, GGDinnell, KDi Salvo, JElliott, JMHollingworth, GJKurtz, MMRidgill, MPRycroft, WTsao, KLSwain, CJ 4,4-Disubstituted cyclohexylamine NK(1) receptor antagonists II. Bioorg Med Chem Lett12:1759-62 (2002) Potassium voltage-gated channel subfamily H member 2
Name:Potassium voltage-gated channel subfamily H member 2
Type:Multi-pass membrane protein
Mol. Mass.:126672.65
Organism:Homo sapiens (Human)
Description:Q12809
Residue:1159
BDBM50114954
NameBDBM50114954
Synonyms:2-(3,5-Bis-trifluoromethyl-phenyl)-N-[4-(2-oxo-1-oxa-8-aza-spiro[4.5]dec-8-yl)-1-phenyl-cyclohexyl]-propionamide | CHEMBL3085126
TypeSmall organic molecule
Emp. Form.C32H36F6N2O3
Mol. Mass.610.6303
SMILESCC(C(=O)NC1(CCC(CC1)N1CCC(CC1)C1CCC(=O)O1)c1ccccc1)c1cc(cc(c1)C(F)(F)F)C(F)(F)F