Reaction Details
TargetNitric oxide synthase, brain
LigandBDBM50115150
Substrate/Competitorn/a
Meas. Tech.ChEMBL_143354 (CHEMBL751278)
IC50 20000±n/a nM
Citation Matter, HKotsonis, PKlingler, OStrobel, HFröhlich, LGFrey, APfleiderer, WSchmidt, HH Structural requirements for inhibition of the neuronal nitric oxide synthase (NOS-I): 3D-QSAR analysis of 4-oxo- and 4-amino-pteridine-based inhibitors. J Med Chem45:2923-41 (2002) Nitric oxide synthase, brain
Name:Nitric oxide synthase, brain
Type:Homodimer
Mol. Mass.:160985.98
Organism:Homo sapiens (Human)
Description:P29475
Residue:1434
BDBM50115150
NameBDBM50115150
Synonyms:2-Amino-6-methylaminomethyl-5,6,7,8-tetrahydro-3H-pteridin-4-one | CHEMBL420453
TypeSmall organic molecule
Emp. Form.C8H14N6O
Mol. Mass.210.2364
SMILESCNCC1CNc2nc(N)[nH]c(=O)c2N1