Reaction Details
TargetMelanocyte-stimulating hormone receptor
LigandBDBM50115292
Substrate/Competitorn/a
Meas. Tech.ChEMBL_104587 (CHEMBL715332)
IC50 0.790000±n/a nM
Citation Cheng, ZChen, JMiao, YOwen, NKQuinn, TPJurisson, SS Modification of the structure of a metallopeptide: synthesis and biological evaluation of (111)In-labeled DOTA-conjugated rhenium-cyclized alpha-MSH analogues. J Med Chem45:3048-56 (2002) Melanocyte-stimulating hormone receptor
Name:Melanocyte-stimulating hormone receptor
Type:PROTEIN
Mol. Mass.:35238.60
Organism:Mus musculus
Description:ChEMBL_1498846
Residue:315
BDBM50115292
NameBDBM50115292
Synonyms:CHEMBL438180 | DOTA-ReCCEHdFRWCKPVD-OH
TypeSmall organic molecule
Emp. Form.C79H111N25O25ReS3
Mol. Mass.2093.282
SMILESCC(C)C(NC(=O)C1CCCN1C(=O)C(CCCNC(N)=N)NC(=O)C1NC(=O)C(Cc2c[nH]c3ccccc23)NC(=O)C(CCCNC(N)=N)NC(=O)[C@H](Cc2ccccc2)NC(=O)C(Cc2cnc[nH]2)NC(=O)C(CCC(O)=O)NC(=O)C2S[Re-]3([O-])(SC(NC(=O)CN4CCN(CC(O)=O)CCN(CC(O)=O)CCN(CC(O)=O)CC4)C(=O)N23)S1)C(=O)NC(CC(O)=O)C(O)=O