Reaction Details
TargetReceptor-type tyrosine-protein kinase FLT3
LigandBDBM50115301
Substrate/Competitorn/a
Meas. Tech.ChEMBL_68356 (CHEMBL679498)
IC50 230±n/a nM
Citation Matsuno, KIchimura, MNakajima, TTahara, KFujiwara, SKase, HUshiki, JGiese, NAPandey, AScarborough, RMLokker, NAYu, JCIrie, JTsukuda, EIde, SOda, SNomoto, Y Potent and selective inhibitors of platelet-derived growth factor receptor phosphorylation. 1. Synthesis, structure-activity relationship, and biological effects of a new class of quinazoline derivatives. J Med Chem45:3057-66 (2002) Receptor-type tyrosine-protein kinase FLT3
Name:Receptor-type tyrosine-protein kinase FLT3
Type:Enzyme
Mol. Mass.:112888.62
Organism:Homo sapiens (Human)
Description:P36888
Residue:993
BDBM50115301
NameBDBM50115301
Synonyms:4-(6,7-Dimethoxy-quinazolin-4-yl)-piperazine-1-carboxylic acid (4-phenoxy-phenyl)-amide | CHEMBL102346
TypeSmall organic molecule
Emp. Form.C27H27N5O4
Mol. Mass.485.5344
SMILESCOc1cc2ncnc(N3CCN(CC3)C(=O)Nc3ccc(Oc4ccccc4)cc3)c2cc1OC