Reaction Details
TargetDual specificity mitogen-activated protein kinase kinase 3
LigandBDBM50115295
Substrate/Competitorn/a
Meas. Tech.ChEMBL_123985 (CHEMBL732663)
IC50>30000±n/a nM
Citation Matsuno, KIchimura, MNakajima, TTahara, KFujiwara, SKase, HUshiki, JGiese, NAPandey, AScarborough, RMLokker, NAYu, JCIrie, JTsukuda, EIde, SOda, SNomoto, Y Potent and selective inhibitors of platelet-derived growth factor receptor phosphorylation. 1. Synthesis, structure-activity relationship, and biological effects of a new class of quinazoline derivatives. J Med Chem45:3057-66 (2002) Dual specificity mitogen-activated protein kinase kinase 3
Name:Dual specificity mitogen-activated protein kinase kinase 3
Type:Protein
Mol. Mass.:39321.50
Organism:Homo sapiens (Human)
Description:n/a
Residue:347
BDBM50115295
NameBDBM50115295
Synonyms:4-(6,7-Dimethoxy-quinazolin-4-yl)-piperazine-1-carboxylic acid (4-nitro-phenyl)-amide CHEMBL99743
TypeSmall organic molecule
Emp. Form.C21H22N6O5
Mol. Mass.438.4366
SMILESCOc1cc2ncnc(N3CCN(CC3)C(=O)Nc3ccc(cc3)[N+]([O-])=O)c2cc1OC