Reaction Details
TargetDual specificity mitogen-activated protein kinase kinase 6
LigandBDBM50115298
Substrate/Competitorn/a
Meas. Tech.ChEMBL_123998 (CHEMBL734026)
IC50>30000±n/a nM
Citation Matsuno, KIchimura, MNakajima, TTahara, KFujiwara, SKase, HUshiki, JGiese, NAPandey, AScarborough, RMLokker, NAYu, JCIrie, JTsukuda, EIde, SOda, SNomoto, Y Potent and selective inhibitors of platelet-derived growth factor receptor phosphorylation. 1. Synthesis, structure-activity relationship, and biological effects of a new class of quinazoline derivatives. J Med Chem45:3057-66 (2002) Dual specificity mitogen-activated protein kinase kinase 6
Name:Dual specificity mitogen-activated protein kinase kinase 6
Type:Protein
Mol. Mass.:37494.96
Organism:Homo sapiens (Human)
Description:P52564
Residue:334
BDBM50115298
NameBDBM50115298
Synonyms:4-(6,7-Dimethoxy-quinazolin-4-yl)-piperazine-1-carboxylic acid (4-bromo-phenyl)-amide | CHEMBL323336
TypeSmall organic molecule
Emp. Form.C21H22BrN5O3
Mol. Mass.472.335
SMILESCOc1cc2ncnc(N3CCN(CC3)C(=O)Nc3ccc(Br)cc3)c2cc1OC