Reaction Details
TargetPlatelet-derived growth factor receptor beta
LigandBDBM50115318
Substrate/Competitorn/a
Meas. Tech.ChEMBL_158524 (CHEMBL768951)
IC50>30000±n/a nM
Citation Matsuno, KIchimura, MNakajima, TTahara, KFujiwara, SKase, HUshiki, JGiese, NAPandey, AScarborough, RMLokker, NAYu, JCIrie, JTsukuda, EIde, SOda, SNomoto, Y Potent and selective inhibitors of platelet-derived growth factor receptor phosphorylation. 1. Synthesis, structure-activity relationship, and biological effects of a new class of quinazoline derivatives. J Med Chem45:3057-66 (2002) Platelet-derived growth factor receptor beta
Name:Platelet-derived growth factor receptor beta
Type:Enzyme
Mol. Mass.:123922.25
Organism:Homo sapiens (Human)
Description:P09619
Residue:1106
BDBM50115318
NameBDBM50115318
Synonyms:3-{[4-(6,7-Dimethoxy-quinazolin-4-yl)-piperazine-1-carbothioyl]-amino}-benzoic acid | CHEMBL104924
TypeSmall organic molecule
Emp. Form.C22H23N5O4S
Mol. Mass.453.514
SMILESCOc1cc2ncnc(N3CCN(CC3)C(=S)Nc3cccc(c3)C(O)=O)c2cc1OC