Reaction Details
TargetPlatelet-derived growth factor receptor beta
LigandBDBM50115320
Substrate/Competitorn/a
Meas. Tech.ChEMBL_158524 (CHEMBL768951)
IC50 5360.0±n/a nM
Citation Matsuno, KIchimura, MNakajima, TTahara, KFujiwara, SKase, HUshiki, JGiese, NAPandey, AScarborough, RMLokker, NAYu, JCIrie, JTsukuda, EIde, SOda, SNomoto, Y Potent and selective inhibitors of platelet-derived growth factor receptor phosphorylation. 1. Synthesis, structure-activity relationship, and biological effects of a new class of quinazoline derivatives. J Med Chem45:3057-66 (2002) Platelet-derived growth factor receptor beta
Name:Platelet-derived growth factor receptor beta
Type:Enzyme
Mol. Mass.:123922.25
Organism:Homo sapiens (Human)
Description:P09619
Residue:1106
BDBM50115320
NameBDBM50115320
Synonyms:4-(6,7-Dimethoxy-quinazolin-4-yl)-piperazine-1-carboxylic acid (4-methoxy-phenyl)-amide | CHEMBL106332
TypeSmall organic molecule
Emp. Form.C22H25N5O4
Mol. Mass.423.465
SMILESCOc1ccc(NC(=O)N2CCN(CC2)c2ncnc3cc(OC)c(OC)cc23)cc1