Reaction Details
TargetPlatelet-derived growth factor receptor beta
LigandBDBM50115297
Substrate/Competitorn/a
Meas. Tech.ChEMBL_158524 (CHEMBL768951)
IC50 850.0±n/a nM
Citation Matsuno, KIchimura, MNakajima, TTahara, KFujiwara, SKase, HUshiki, JGiese, NAPandey, AScarborough, RMLokker, NAYu, JCIrie, JTsukuda, EIde, SOda, SNomoto, Y Potent and selective inhibitors of platelet-derived growth factor receptor phosphorylation. 1. Synthesis, structure-activity relationship, and biological effects of a new class of quinazoline derivatives. J Med Chem45:3057-66 (2002) Platelet-derived growth factor receptor beta
Name:Platelet-derived growth factor receptor beta
Type:Enzyme
Mol. Mass.:123922.25
Organism:Homo sapiens (Human)
Description:P09619
Residue:1106
BDBM50115297
NameBDBM50115297
Synonyms:4-(6,7-Dimethoxy-quinazolin-4-yl)-piperazine-1-carboxylic acid (4-cyano-phenyl)-amide | CHEMBL106966
TypeSmall organic molecule
Emp. Form.C22H22N6O3
Mol. Mass.418.4485
SMILESCOc1cc2ncnc(N3CCN(CC3)C(=O)Nc3ccc(cc3)C#N)c2cc1OC