Reaction Details
TargetC-C chemokine receptor type 5
LigandBDBM50104940
Substrate/Competitorn/a
Meas. Tech.ChEMBL_49996 (CHEMBL661336)
Ki 1.1±n/a nM
Citation Palani, AShapiro, SJosien, HBara, TClader, JWGreenlee, WJCox, KStrizki, JMBaroudy, BM Synthesis, SAR, and biological evaluation of oximino-piperidino-piperidine amides. 1. Orally bioavailable CCR5 receptor antagonists with potent anti-HIV activity. J Med Chem45:3143-60 (2002) C-C chemokine receptor type 5
Name:C-C chemokine receptor type 5
Type:PROTEIN
Mol. Mass.:40803.93
Organism:Mus musculus
Description:ChEMBL_49996
Residue:354
BDBM50104940
NameBDBM50104940
Synonyms:CHEMBL323172 | {4-[(4-Bromo-phenyl)-methoxyimino-methyl]-4'-methyl-[1,4']bipiperidinyl-1'-yl}-(2,4-dimethyl-pyridin-3-yl)-methanone
TypeSmall organic molecule
Emp. Form.C27H35BrN4O2
Mol. Mass.527.496
SMILESCO\N=C(\C1CCN(CC1)C1(C)CCN(CC1)C(=O)c1c(C)ccnc1C)c1ccc(Br)cc1