Reaction Details
TargetC-C chemokine receptor type 5
LigandBDBM50115546
Substrate/Competitorn/a
Meas. Tech.ChEMBL_49996 (CHEMBL661336)
Ki 55±n/a nM
Citation Palani, AShapiro, SJosien, HBara, TClader, JWGreenlee, WJCox, KStrizki, JMBaroudy, BM Synthesis, SAR, and biological evaluation of oximino-piperidino-piperidine amides. 1. Orally bioavailable CCR5 receptor antagonists with potent anti-HIV activity. J Med Chem45:3143-60 (2002) C-C chemokine receptor type 5
Name:C-C chemokine receptor type 5
Type:PROTEIN
Mol. Mass.:40803.93
Organism:Mus musculus
Description:ChEMBL_49996
Residue:354
BDBM50115546
NameBDBM50115546
Synonyms:(2,6-Dimethyl-phenyl)-[4'-methyl-4-(4-trifluoromethoxy-benzyl)-[1,4']bipiperidinyl-1'-yl]-methanone | CHEMBL317476
TypeSmall organic molecule
Emp. Form.C28H35F3N2O2
Mol. Mass.488.5849
SMILESCc1cccc(C)c1C(=O)N1CCC(C)(CC1)N1CCC(Cc2ccc(OC(F)(F)F)cc2)CC1