Reaction Details
TargetC-C chemokine receptor type 5
LigandBDBM50115536
Substrate/Competitorn/a
Meas. Tech.ChEMBL_49996 (CHEMBL661336)
Ki 30±n/a nM
Citation Palani, AShapiro, SJosien, HBara, TClader, JWGreenlee, WJCox, KStrizki, JMBaroudy, BM Synthesis, SAR, and biological evaluation of oximino-piperidino-piperidine amides. 1. Orally bioavailable CCR5 receptor antagonists with potent anti-HIV activity. J Med Chem45:3143-60 (2002) C-C chemokine receptor type 5
Name:C-C chemokine receptor type 5
Type:PROTEIN
Mol. Mass.:40803.93
Organism:Mus musculus
Description:ChEMBL_49996
Residue:354
BDBM50115536
NameBDBM50115536
Synonyms:(2,4-Dimethyl-1-oxy-pyridin-3-yl)-{4-[ethoxyimino-(4-fluoro-phenyl)-methyl]-4'-methyl-[1,4']bipiperidinyl-1'-yl}-methanone CHEMBL141345
TypeSmall organic molecule
Emp. Form.C28H37FN4O3
Mol. Mass.496.6168
SMILESCCO[N-][C+](C1CCN(CC1)C1(C)CCN(CC1)C(=O)c1c(C)cc[n+]([O-])c1C)c1ccc(F)cc1