Reaction Details
TargetC-C chemokine receptor type 5
LigandBDBM50115513
Substrate/Competitorn/a
Meas. Tech.ChEMBL_49996 (CHEMBL661336)
Ki 113±n/a nM
Citation Palani, AShapiro, SJosien, HBara, TClader, JWGreenlee, WJCox, KStrizki, JMBaroudy, BM Synthesis, SAR, and biological evaluation of oximino-piperidino-piperidine amides. 1. Orally bioavailable CCR5 receptor antagonists with potent anti-HIV activity. J Med Chem45:3143-60 (2002) C-C chemokine receptor type 5
Name:C-C chemokine receptor type 5
Type:PROTEIN
Mol. Mass.:40803.93
Organism:Mus musculus
Description:ChEMBL_49996
Residue:354
BDBM50115513
NameBDBM50115513
Synonyms:(2,6-Dimethyl-phenyl)-[4'-methyl-4-(4-methyl-benzyl)-[1,4']bipiperidinyl-1'-yl]-methanone | CHEMBL110786
TypeSmall organic molecule
Emp. Form.C28H38N2O
Mol. Mass.418.6141
SMILESCc1ccc(CC2CCN(CC2)C2(C)CCN(CC2)C(=O)c2c(C)cccc2C)cc1