Reaction Details
TargetC-C chemokine receptor type 5
LigandBDBM50115538
Substrate/Competitorn/a
Meas. Tech.ChEMBL_49996 (CHEMBL661336)
Ki 16±n/a nM
Citation Palani, AShapiro, SJosien, HBara, TClader, JWGreenlee, WJCox, KStrizki, JMBaroudy, BM Synthesis, SAR, and biological evaluation of oximino-piperidino-piperidine amides. 1. Orally bioavailable CCR5 receptor antagonists with potent anti-HIV activity. J Med Chem45:3143-60 (2002) C-C chemokine receptor type 5
Name:C-C chemokine receptor type 5
Type:PROTEIN
Mol. Mass.:40803.93
Organism:Mus musculus
Description:ChEMBL_49996
Residue:354
BDBM50115538
NameBDBM50115538
Synonyms:4-[(Z)-(4-Bromophenyl)(ethoxyimino)methyl]-4'-methyl-1'-[(3-methyl-2-pyridinyl)carbonyl]-1,4'-bipiperidine NOxide {4-[(4-Bromo-phenyl)-ethoxyimino-methyl]-4'-methyl-[1,4']bipiperidinyl-1'-yl}-(3-methyl-1-oxy-pyridin-2-yl)-methanone
TypeSmall organic molecule
Emp. Form.C27H35BrN4O3
Mol. Mass.543.496
SMILESCCO\N=C(\C1CCN(CC1)C1(C)CCN(CC1)C(=O)c1c(C)ccc[n+]1[O-])c1ccc(Br)cc1